Project

General

Profile

Bug #591 » userspace-rcu-config.log

userspace-rcu config log - Daniel U. Thibault, 07/10/2013 05:50 PM

 
1
This file contains any messages produced by compilers while
2
running configure, to aid debugging if configure makes a mistake.
3

    
4
It was created by userspace-rcu configure 0.7.4, which was
5
generated by GNU Autoconf 2.68.  Invocation command line was
6

    
7
  $ ./configure 
8

    
9
## --------- ##
10
## Platform. ##
11
## --------- ##
12

    
13
hostname = sds-dut-vb
14
uname -m = x86_64
15
uname -r = 3.2.0-40-virtual
16
uname -s = Linux
17
uname -v = #64-Ubuntu SMP Mon Mar 25 21:42:18 UTC 2013
18

    
19
/usr/bin/uname -p = unknown
20
/bin/uname -X     = unknown
21

    
22
/bin/arch              = unknown
23
/usr/bin/arch -k       = unknown
24
/usr/convex/getsysinfo = unknown
25
/usr/bin/hostinfo      = unknown
26
/bin/machine           = unknown
27
/usr/bin/oslevel       = unknown
28
/bin/universe          = unknown
29

    
30
PATH: /usr/local/sbin
31
PATH: /usr/local/bin
32
PATH: /usr/sbin
33
PATH: /usr/bin
34
PATH: /sbin
35
PATH: /bin
36
PATH: /usr/games
37

    
38

    
39
## ----------- ##
40
## Core tests. ##
41
## ----------- ##
42

    
43
configure:2303: checking build system type
44
configure:2317: result: x86_64-unknown-linux-gnu
45
configure:2337: checking host system type
46
configure:2350: result: x86_64-unknown-linux-gnu
47
configure:2370: checking target system type
48
configure:2383: result: x86_64-unknown-linux-gnu
49
configure:2426: checking for a BSD-compatible install
50
configure:2494: result: /usr/bin/install -c
51
configure:2505: checking whether build environment is sane
52
configure:2555: result: yes
53
configure:2696: checking for a thread-safe mkdir -p
54
configure:2735: result: /bin/mkdir -p
55
configure:2748: checking for gawk
56
configure:2778: result: no
57
configure:2748: checking for mawk
58
configure:2764: found /usr/bin/mawk
59
configure:2775: result: mawk
60
configure:2786: checking whether make sets $(MAKE)
61
configure:2808: result: yes
62
configure:2899: checking whether make supports nested variables
63
configure:2916: result: yes
64
configure:3021: checking for style of include used by make
65
configure:3049: result: GNU
66
configure:3120: checking for gcc
67
configure:3136: found /usr/bin/gcc
68
configure:3147: result: gcc
69
configure:3376: checking for C compiler version
70
configure:3385: gcc --version >&5
71
gcc (Ubuntu/Linaro 4.6.3-1ubuntu5) 4.6.3
72
Copyright (C) 2011 Free Software Foundation, Inc.
73
This is free software; see the source for copying conditions.  There is NO
74
warranty; not even for MERCHANTABILITY or FITNESS FOR A PARTICULAR PURPOSE.
75

    
76
configure:3396: $? = 0
77
configure:3385: gcc -v >&5
78
Using built-in specs.
79
COLLECT_GCC=gcc
80
COLLECT_LTO_WRAPPER=/usr/lib/gcc/x86_64-linux-gnu/4.6/lto-wrapper
81
Target: x86_64-linux-gnu
82
Configured with: ../src/configure -v --with-pkgversion='Ubuntu/Linaro 4.6.3-1ubuntu5' --with-bugurl=file:///usr/share/doc/gcc-4.6/README.Bugs --enable-languages=c,c++,fortran,objc,obj-c++ --prefix=/usr --program-suffix=-4.6 --enable-shared --enable-linker-build-id --with-system-zlib --libexecdir=/usr/lib --without-included-gettext --enable-threads=posix --with-gxx-include-dir=/usr/include/c++/4.6 --libdir=/usr/lib --enable-nls --with-sysroot=/ --enable-clocale=gnu --enable-libstdcxx-debug --enable-libstdcxx-time=yes --enable-gnu-unique-object --enable-plugin --enable-objc-gc --disable-werror --with-arch-32=i686 --with-tune=generic --enable-checking=release --build=x86_64-linux-gnu --host=x86_64-linux-gnu --target=x86_64-linux-gnu
83
Thread model: posix
84
gcc version 4.6.3 (Ubuntu/Linaro 4.6.3-1ubuntu5) 
85
configure:3396: $? = 0
86
configure:3385: gcc -V >&5
87
gcc: error: unrecognized option '-V'
88
gcc: fatal error: no input files
89
compilation terminated.
90
configure:3396: $? = 4
91
configure:3385: gcc -qversion >&5
92
gcc: error: unrecognized option '-qversion'
93
gcc: fatal error: no input files
94
compilation terminated.
95
configure:3396: $? = 4
96
configure:3416: checking whether the C compiler works
97
configure:3438: gcc    conftest.c  >&5
98
configure:3442: $? = 0
99
configure:3490: result: yes
100
configure:3493: checking for C compiler default output file name
101
configure:3495: result: a.out
102
configure:3501: checking for suffix of executables
103
configure:3508: gcc -o conftest    conftest.c  >&5
104
configure:3512: $? = 0
105
configure:3534: result: 
106
configure:3556: checking whether we are cross compiling
107
configure:3564: gcc -o conftest    conftest.c  >&5
108
configure:3568: $? = 0
109
configure:3575: ./conftest
110
configure:3579: $? = 0
111
configure:3594: result: no
112
configure:3599: checking for suffix of object files
113
configure:3621: gcc -c   conftest.c >&5
114
configure:3625: $? = 0
115
configure:3646: result: o
116
configure:3650: checking whether we are using the GNU C compiler
117
configure:3669: gcc -c   conftest.c >&5
118
configure:3669: $? = 0
119
configure:3678: result: yes
120
configure:3687: checking whether gcc accepts -g
121
configure:3707: gcc -c -g  conftest.c >&5
122
configure:3707: $? = 0
123
configure:3748: result: yes
124
configure:3765: checking for gcc option to accept ISO C89
125
configure:3829: gcc  -c -g -O2  conftest.c >&5
126
configure:3829: $? = 0
127
configure:3842: result: none needed
128
configure:3864: checking dependency style of gcc
129
configure:3975: result: gcc3
130
configure:3993: checking for thread local storage (TLS) class
131
configure:4016: gcc -o conftest -g -O2   conftest.c  >&5
132
configure:4016: $? = 0
133
configure:4029: result: __thread
134
configure:4106: checking for gcc
135
configure:4133: result: gcc
136
configure:4362: checking for C compiler version
137
configure:4371: gcc --version >&5
138
gcc (Ubuntu/Linaro 4.6.3-1ubuntu5) 4.6.3
139
Copyright (C) 2011 Free Software Foundation, Inc.
140
This is free software; see the source for copying conditions.  There is NO
141
warranty; not even for MERCHANTABILITY or FITNESS FOR A PARTICULAR PURPOSE.
142

    
143
configure:4382: $? = 0
144
configure:4371: gcc -v >&5
145
Using built-in specs.
146
COLLECT_GCC=gcc
147
COLLECT_LTO_WRAPPER=/usr/lib/gcc/x86_64-linux-gnu/4.6/lto-wrapper
148
Target: x86_64-linux-gnu
149
Configured with: ../src/configure -v --with-pkgversion='Ubuntu/Linaro 4.6.3-1ubuntu5' --with-bugurl=file:///usr/share/doc/gcc-4.6/README.Bugs --enable-languages=c,c++,fortran,objc,obj-c++ --prefix=/usr --program-suffix=-4.6 --enable-shared --enable-linker-build-id --with-system-zlib --libexecdir=/usr/lib --without-included-gettext --enable-threads=posix --with-gxx-include-dir=/usr/include/c++/4.6 --libdir=/usr/lib --enable-nls --with-sysroot=/ --enable-clocale=gnu --enable-libstdcxx-debug --enable-libstdcxx-time=yes --enable-gnu-unique-object --enable-plugin --enable-objc-gc --disable-werror --with-arch-32=i686 --with-tune=generic --enable-checking=release --build=x86_64-linux-gnu --host=x86_64-linux-gnu --target=x86_64-linux-gnu
150
Thread model: posix
151
gcc version 4.6.3 (Ubuntu/Linaro 4.6.3-1ubuntu5) 
152
configure:4382: $? = 0
153
configure:4371: gcc -V >&5
154
gcc: error: unrecognized option '-V'
155
gcc: fatal error: no input files
156
compilation terminated.
157
configure:4382: $? = 4
158
configure:4371: gcc -qversion >&5
159
gcc: error: unrecognized option '-qversion'
160
gcc: fatal error: no input files
161
compilation terminated.
162
configure:4382: $? = 4
163
configure:4386: checking whether we are using the GNU C compiler
164
configure:4414: result: yes
165
configure:4423: checking whether gcc accepts -g
166
configure:4484: result: yes
167
configure:4501: checking for gcc option to accept ISO C89
168
configure:4578: result: none needed
169
configure:4600: checking dependency style of gcc
170
configure:4711: result: gcc3
171
configure:4726: checking whether make sets $(MAKE)
172
configure:4748: result: yes
173
configure:4803: checking how to print strings
174
configure:4830: result: printf
175
configure:4851: checking for a sed that does not truncate output
176
configure:4915: result: /bin/sed
177
configure:4933: checking for grep that handles long lines and -e
178
configure:4991: result: /bin/grep
179
configure:4996: checking for egrep
180
configure:5058: result: /bin/grep -E
181
configure:5063: checking for fgrep
182
configure:5125: result: /bin/grep -F
183
configure:5160: checking for ld used by gcc
184
configure:5227: result: /usr/bin/ld
185
configure:5234: checking if the linker (/usr/bin/ld) is GNU ld
186
configure:5249: result: yes
187
configure:5261: checking for BSD- or MS-compatible name lister (nm)
188
configure:5310: result: /usr/bin/nm -B
189
configure:5440: checking the name lister (/usr/bin/nm -B) interface
190
configure:5447: gcc -c -g -O2  conftest.c >&5
191
configure:5450: /usr/bin/nm -B "conftest.o"
192
configure:5453: output
193
0000000000000000 B some_variable
194
configure:5460: result: BSD nm
195
configure:5463: checking whether ln -s works
196
configure:5467: result: yes
197
configure:5475: checking the maximum length of command line arguments
198
configure:5605: result: 1572864
199
configure:5622: checking whether the shell understands some XSI constructs
200
configure:5632: result: yes
201
configure:5636: checking whether the shell understands "+="
202
configure:5642: result: yes
203
configure:5677: checking how to convert x86_64-unknown-linux-gnu file names to x86_64-unknown-linux-gnu format
204
configure:5717: result: func_convert_file_noop
205
configure:5724: checking how to convert x86_64-unknown-linux-gnu file names to toolchain format
206
configure:5744: result: func_convert_file_noop
207
configure:5751: checking for /usr/bin/ld option to reload object files
208
configure:5758: result: -r
209
configure:5832: checking for objdump
210
configure:5848: found /usr/bin/objdump
211
configure:5859: result: objdump
212
configure:5891: checking how to recognize dependent libraries
213
configure:6093: result: pass_all
214
configure:6178: checking for dlltool
215
configure:6208: result: no
216
configure:6238: checking how to associate runtime and link libraries
217
configure:6265: result: printf %s\n
218
configure:6325: checking for ar
219
configure:6341: found /usr/bin/ar
220
configure:6352: result: ar
221
configure:6389: checking for archiver @FILE support
222
configure:6406: gcc -c -g -O2  conftest.c >&5
223
configure:6406: $? = 0
224
configure:6409: ar cru libconftest.a @conftest.lst >&5
225
configure:6412: $? = 0
226
configure:6417: ar cru libconftest.a @conftest.lst >&5
227
ar: conftest.o: No such file or directory
228
configure:6420: $? = 1
229
configure:6432: result: @
230
configure:6490: checking for strip
231
configure:6506: found /usr/bin/strip
232
configure:6517: result: strip
233
configure:6589: checking for ranlib
234
configure:6605: found /usr/bin/ranlib
235
configure:6616: result: ranlib
236
configure:6718: checking command to parse /usr/bin/nm -B output from gcc object
237
configure:6838: gcc -c -g -O2  conftest.c >&5
238
configure:6841: $? = 0
239
configure:6845: /usr/bin/nm -B conftest.o \| sed -n -e 's/^.*[ ]\([ABCDGIRSTW][ABCDGIRSTW]*\)[ ][ ]*\([_A-Za-z][_A-Za-z0-9]*\)$/\1 \2 \2/p' | sed '/ __gnu_lto/d' \> conftest.nm
240
configure:6848: $? = 0
241
configure:6914: gcc -o conftest -g -O2   conftest.c conftstm.o >&5
242
configure:6917: $? = 0
243
configure:6955: result: ok
244
configure:6992: checking for sysroot
245
configure:7022: result: no
246
configure:7099: gcc -c -g -O2  conftest.c >&5
247
configure:7102: $? = 0
248
configure:7278: checking for mt
249
configure:7294: found /bin/mt
250
configure:7305: result: mt
251
configure:7328: checking if mt is a manifest tool
252
configure:7334: mt '-?'
253
configure:7342: result: no
254
configure:7984: checking how to run the C preprocessor
255
configure:8015: gcc -E  conftest.c
256
configure:8015: $? = 0
257
configure:8029: gcc -E  conftest.c
258
conftest.c:13:28: fatal error: ac_nonexistent.h: No such file or directory
259
compilation terminated.
260
configure:8029: $? = 1
261
configure: failed program was:
262
| /* confdefs.h */
263
| #define PACKAGE_NAME "userspace-rcu"
264
| #define PACKAGE_TARNAME "userspace-rcu"
265
| #define PACKAGE_VERSION "0.7.4"
266
| #define PACKAGE_STRING "userspace-rcu 0.7.4"
267
| #define PACKAGE_BUGREPORT "mathieu dot desnoyers at efficios dot com"
268
| #define PACKAGE_URL ""
269
| #define PACKAGE "userspace-rcu"
270
| #define VERSION "0.7.4"
271
| #define TLS __thread
272
| #define CONFIG_RCU_TLS __thread
273
| /* end confdefs.h.  */
274
| #include <ac_nonexistent.h>
275
configure:8054: result: gcc -E
276
configure:8074: gcc -E  conftest.c
277
configure:8074: $? = 0
278
configure:8088: gcc -E  conftest.c
279
conftest.c:13:28: fatal error: ac_nonexistent.h: No such file or directory
280
compilation terminated.
281
configure:8088: $? = 1
282
configure: failed program was:
283
| /* confdefs.h */
284
| #define PACKAGE_NAME "userspace-rcu"
285
| #define PACKAGE_TARNAME "userspace-rcu"
286
| #define PACKAGE_VERSION "0.7.4"
287
| #define PACKAGE_STRING "userspace-rcu 0.7.4"
288
| #define PACKAGE_BUGREPORT "mathieu dot desnoyers at efficios dot com"
289
| #define PACKAGE_URL ""
290
| #define PACKAGE "userspace-rcu"
291
| #define VERSION "0.7.4"
292
| #define TLS __thread
293
| #define CONFIG_RCU_TLS __thread
294
| /* end confdefs.h.  */
295
| #include <ac_nonexistent.h>
296
configure:8117: checking for ANSI C header files
297
configure:8137: gcc -c -g -O2  conftest.c >&5
298
configure:8137: $? = 0
299
configure:8210: gcc -o conftest -g -O2   conftest.c  >&5
300
configure:8210: $? = 0
301
configure:8210: ./conftest
302
configure:8210: $? = 0
303
configure:8221: result: yes
304
configure:8234: checking for sys/types.h
305
configure:8234: gcc -c -g -O2  conftest.c >&5
306
configure:8234: $? = 0
307
configure:8234: result: yes
308
configure:8234: checking for sys/stat.h
309
configure:8234: gcc -c -g -O2  conftest.c >&5
310
configure:8234: $? = 0
311
configure:8234: result: yes
312
configure:8234: checking for stdlib.h
313
configure:8234: gcc -c -g -O2  conftest.c >&5
314
configure:8234: $? = 0
315
configure:8234: result: yes
316
configure:8234: checking for string.h
317
configure:8234: gcc -c -g -O2  conftest.c >&5
318
configure:8234: $? = 0
319
configure:8234: result: yes
320
configure:8234: checking for memory.h
321
configure:8234: gcc -c -g -O2  conftest.c >&5
322
configure:8234: $? = 0
323
configure:8234: result: yes
324
configure:8234: checking for strings.h
325
configure:8234: gcc -c -g -O2  conftest.c >&5
326
configure:8234: $? = 0
327
configure:8234: result: yes
328
configure:8234: checking for inttypes.h
329
configure:8234: gcc -c -g -O2  conftest.c >&5
330
configure:8234: $? = 0
331
configure:8234: result: yes
332
configure:8234: checking for stdint.h
333
configure:8234: gcc -c -g -O2  conftest.c >&5
334
configure:8234: $? = 0
335
configure:8234: result: yes
336
configure:8234: checking for unistd.h
337
configure:8234: gcc -c -g -O2  conftest.c >&5
338
configure:8234: $? = 0
339
configure:8234: result: yes
340
configure:8248: checking for dlfcn.h
341
configure:8248: gcc -c -g -O2  conftest.c >&5
342
configure:8248: $? = 0
343
configure:8248: result: yes
344
configure:8454: checking for objdir
345
configure:8469: result: .libs
346
configure:8740: checking if gcc supports -fno-rtti -fno-exceptions
347
configure:8758: gcc -c -g -O2  -fno-rtti -fno-exceptions conftest.c >&5
348
cc1: warning: command line option '-fno-rtti' is valid for C++/ObjC++ but not for C [enabled by default]
349
configure:8762: $? = 0
350
configure:8775: result: no
351
configure:9102: checking for gcc option to produce PIC
352
configure:9109: result: -fPIC -DPIC
353
configure:9117: checking if gcc PIC flag -fPIC -DPIC works
354
configure:9135: gcc -c -g -O2  -fPIC -DPIC -DPIC conftest.c >&5
355
configure:9139: $? = 0
356
configure:9152: result: yes
357
configure:9181: checking if gcc static flag -static works
358
configure:9209: result: yes
359
configure:9224: checking if gcc supports -c -o file.o
360
configure:9245: gcc -c -g -O2  -o out/conftest2.o conftest.c >&5
361
configure:9249: $? = 0
362
configure:9271: result: yes
363
configure:9279: checking if gcc supports -c -o file.o
364
configure:9326: result: yes
365
configure:9359: checking whether the gcc linker (/usr/bin/ld -m elf_x86_64) supports shared libraries
366
configure:10516: result: yes
367
configure:10553: checking whether -lc should be explicitly linked in
368
configure:10561: gcc -c -g -O2  conftest.c >&5
369
configure:10564: $? = 0
370
configure:10579: gcc -shared  -fPIC -DPIC conftest.o  -v -Wl,-soname -Wl,conftest -o conftest 2\>\&1 \| /bin/grep  -lc  \>/dev/null 2\>\&1
371
configure:10582: $? = 0
372
configure:10596: result: no
373
configure:10756: checking dynamic linker characteristics
374
configure:11267: gcc -o conftest -g -O2   -Wl,-rpath -Wl,/foo conftest.c  >&5
375
configure:11267: $? = 0
376
configure:11501: result: GNU/Linux ld.so
377
configure:11608: checking how to hardcode library paths into programs
378
configure:11633: result: immediate
379
configure:12173: checking whether stripping libraries is possible
380
configure:12178: result: yes
381
configure:12213: checking if libtool supports shared libraries
382
configure:12215: result: yes
383
configure:12218: checking whether to build shared libraries
384
configure:12239: result: yes
385
configure:12242: checking whether to build static libraries
386
configure:12246: result: yes
387
configure:12285: checking for inline
388
configure:12301: gcc -c -g -O2  conftest.c >&5
389
configure:12301: $? = 0
390
configure:12309: result: inline
391
configure:12327: checking for pid_t
392
configure:12327: gcc -c -g -O2  conftest.c >&5
393
configure:12327: $? = 0
394
configure:12327: gcc -c -g -O2  conftest.c >&5
395
conftest.c: In function 'main':
396
conftest.c:61:20: error: expected expression before ')' token
397
configure:12327: $? = 1
398
configure: failed program was:
399
| /* confdefs.h */
400
| #define PACKAGE_NAME "userspace-rcu"
401
| #define PACKAGE_TARNAME "userspace-rcu"
402
| #define PACKAGE_VERSION "0.7.4"
403
| #define PACKAGE_STRING "userspace-rcu 0.7.4"
404
| #define PACKAGE_BUGREPORT "mathieu dot desnoyers at efficios dot com"
405
| #define PACKAGE_URL ""
406
| #define PACKAGE "userspace-rcu"
407
| #define VERSION "0.7.4"
408
| #define TLS __thread
409
| #define CONFIG_RCU_TLS __thread
410
| #define STDC_HEADERS 1
411
| #define HAVE_SYS_TYPES_H 1
412
| #define HAVE_SYS_STAT_H 1
413
| #define HAVE_STDLIB_H 1
414
| #define HAVE_STRING_H 1
415
| #define HAVE_MEMORY_H 1
416
| #define HAVE_STRINGS_H 1
417
| #define HAVE_INTTYPES_H 1
418
| #define HAVE_STDINT_H 1
419
| #define HAVE_UNISTD_H 1
420
| #define HAVE_DLFCN_H 1
421
| #define LT_OBJDIR ".libs/"
422
| /* end confdefs.h.  */
423
| #include <stdio.h>
424
| #ifdef HAVE_SYS_TYPES_H
425
| # include <sys/types.h>
426
| #endif
427
| #ifdef HAVE_SYS_STAT_H
428
| # include <sys/stat.h>
429
| #endif
430
| #ifdef STDC_HEADERS
431
| # include <stdlib.h>
432
| # include <stddef.h>
433
| #else
434
| # ifdef HAVE_STDLIB_H
435
| #  include <stdlib.h>
436
| # endif
437
| #endif
438
| #ifdef HAVE_STRING_H
439
| # if !defined STDC_HEADERS && defined HAVE_MEMORY_H
440
| #  include <memory.h>
441
| # endif
442
| # include <string.h>
443
| #endif
444
| #ifdef HAVE_STRINGS_H
445
| # include <strings.h>
446
| #endif
447
| #ifdef HAVE_INTTYPES_H
448
| # include <inttypes.h>
449
| #endif
450
| #ifdef HAVE_STDINT_H
451
| # include <stdint.h>
452
| #endif
453
| #ifdef HAVE_UNISTD_H
454
| # include <unistd.h>
455
| #endif
456
| int
457
| main ()
458
| {
459
| if (sizeof ((pid_t)))
460
| 	    return 0;
461
|   ;
462
|   return 0;
463
| }
464
configure:12327: result: yes
465
configure:12338: checking for size_t
466
configure:12338: gcc -c -g -O2  conftest.c >&5
467
configure:12338: $? = 0
468
configure:12338: gcc -c -g -O2  conftest.c >&5
469
conftest.c: In function 'main':
470
conftest.c:61:21: error: expected expression before ')' token
471
configure:12338: $? = 1
472
configure: failed program was:
473
| /* confdefs.h */
474
| #define PACKAGE_NAME "userspace-rcu"
475
| #define PACKAGE_TARNAME "userspace-rcu"
476
| #define PACKAGE_VERSION "0.7.4"
477
| #define PACKAGE_STRING "userspace-rcu 0.7.4"
478
| #define PACKAGE_BUGREPORT "mathieu dot desnoyers at efficios dot com"
479
| #define PACKAGE_URL ""
480
| #define PACKAGE "userspace-rcu"
481
| #define VERSION "0.7.4"
482
| #define TLS __thread
483
| #define CONFIG_RCU_TLS __thread
484
| #define STDC_HEADERS 1
485
| #define HAVE_SYS_TYPES_H 1
486
| #define HAVE_SYS_STAT_H 1
487
| #define HAVE_STDLIB_H 1
488
| #define HAVE_STRING_H 1
489
| #define HAVE_MEMORY_H 1
490
| #define HAVE_STRINGS_H 1
491
| #define HAVE_INTTYPES_H 1
492
| #define HAVE_STDINT_H 1
493
| #define HAVE_UNISTD_H 1
494
| #define HAVE_DLFCN_H 1
495
| #define LT_OBJDIR ".libs/"
496
| /* end confdefs.h.  */
497
| #include <stdio.h>
498
| #ifdef HAVE_SYS_TYPES_H
499
| # include <sys/types.h>
500
| #endif
501
| #ifdef HAVE_SYS_STAT_H
502
| # include <sys/stat.h>
503
| #endif
504
| #ifdef STDC_HEADERS
505
| # include <stdlib.h>
506
| # include <stddef.h>
507
| #else
508
| # ifdef HAVE_STDLIB_H
509
| #  include <stdlib.h>
510
| # endif
511
| #endif
512
| #ifdef HAVE_STRING_H
513
| # if !defined STDC_HEADERS && defined HAVE_MEMORY_H
514
| #  include <memory.h>
515
| # endif
516
| # include <string.h>
517
| #endif
518
| #ifdef HAVE_STRINGS_H
519
| # include <strings.h>
520
| #endif
521
| #ifdef HAVE_INTTYPES_H
522
| # include <inttypes.h>
523
| #endif
524
| #ifdef HAVE_STDINT_H
525
| # include <stdint.h>
526
| #endif
527
| #ifdef HAVE_UNISTD_H
528
| # include <unistd.h>
529
| #endif
530
| int
531
| main ()
532
| {
533
| if (sizeof ((size_t)))
534
| 	    return 0;
535
|   ;
536
|   return 0;
537
| }
538
configure:12338: result: yes
539
configure:12353: checking for stdlib.h
540
configure:12353: result: yes
541
configure:12363: checking for GNU libc compatible malloc
542
configure:12387: gcc -o conftest -g -O2   conftest.c  >&5
543
configure:12387: $? = 0
544
configure:12387: ./conftest
545
configure:12387: $? = 0
546
configure:12397: result: yes
547
configure:12424: checking for stdlib.h
548
configure:12424: result: yes
549
configure:12424: checking for unistd.h
550
configure:12424: result: yes
551
configure:12424: checking for sys/param.h
552
configure:12424: gcc -c -g -O2  conftest.c >&5
553
configure:12424: $? = 0
554
configure:12424: result: yes
555
configure:12444: checking for getpagesize
556
configure:12444: gcc -o conftest -g -O2   conftest.c  >&5
557
configure:12444: $? = 0
558
configure:12444: result: yes
559
configure:12453: checking for working mmap
560
configure:12600: gcc -o conftest -g -O2   conftest.c  >&5
561
configure:12600: $? = 0
562
configure:12600: ./conftest
563
configure:12600: $? = 0
564
configure:12610: result: yes
565
configure:12622: checking for bzero
566
configure:12622: gcc -o conftest -g -O2   conftest.c  >&5
567
conftest.c:55:6: warning: conflicting types for built-in function 'bzero' [enabled by default]
568
configure:12622: $? = 0
569
configure:12622: result: yes
570
configure:12622: checking for gettimeofday
571
configure:12622: gcc -o conftest -g -O2   conftest.c  >&5
572
configure:12622: $? = 0
573
configure:12622: result: yes
574
configure:12622: checking for munmap
575
configure:12622: gcc -o conftest -g -O2   conftest.c  >&5
576
configure:12622: $? = 0
577
configure:12622: result: yes
578
configure:12622: checking for sched_getcpu
579
configure:12622: gcc -o conftest -g -O2   conftest.c  >&5
580
configure:12622: $? = 0
581
configure:12622: result: yes
582
configure:12622: checking for strtoul
583
configure:12622: gcc -o conftest -g -O2   conftest.c  >&5
584
configure:12622: $? = 0
585
configure:12622: result: yes
586
configure:12622: checking for sysconf
587
configure:12622: gcc -o conftest -g -O2   conftest.c  >&5
588
configure:12622: $? = 0
589
configure:12622: result: yes
590
configure:12770: checking if architecture really supports the mfence instruction
591
configure:12777: result: yes
592
configure:12792: checking for sys_futex()
593
configure:12804: gcc -c -g -O2  conftest.c >&5
594
configure:12804: $? = 0
595
configure:12806: result: yes
596
configure:12892: checking for cpu_set_t
597
configure:12892: gcc -c -g -O2 -D_GNU_SOURCE  conftest.c >&5
598
configure:12892: $? = 0
599
configure:12892: gcc -c -g -O2 -D_GNU_SOURCE  conftest.c >&5
600
conftest.c: In function 'main':
601
conftest.c:46:24: error: expected expression before ')' token
602
configure:12892: $? = 1
603
configure: failed program was:
604
| /* confdefs.h */
605
| #define PACKAGE_NAME "userspace-rcu"
606
| #define PACKAGE_TARNAME "userspace-rcu"
607
| #define PACKAGE_VERSION "0.7.4"
608
| #define PACKAGE_STRING "userspace-rcu 0.7.4"
609
| #define PACKAGE_BUGREPORT "mathieu dot desnoyers at efficios dot com"
610
| #define PACKAGE_URL ""
611
| #define PACKAGE "userspace-rcu"
612
| #define VERSION "0.7.4"
613
| #define TLS __thread
614
| #define CONFIG_RCU_TLS __thread
615
| #define STDC_HEADERS 1
616
| #define HAVE_SYS_TYPES_H 1
617
| #define HAVE_SYS_STAT_H 1
618
| #define HAVE_STDLIB_H 1
619
| #define HAVE_STRING_H 1
620
| #define HAVE_MEMORY_H 1
621
| #define HAVE_STRINGS_H 1
622
| #define HAVE_INTTYPES_H 1
623
| #define HAVE_STDINT_H 1
624
| #define HAVE_UNISTD_H 1
625
| #define HAVE_DLFCN_H 1
626
| #define LT_OBJDIR ".libs/"
627
| #define HAVE_STDLIB_H 1
628
| #define HAVE_MALLOC 1
629
| #define HAVE_STDLIB_H 1
630
| #define HAVE_UNISTD_H 1
631
| #define HAVE_SYS_PARAM_H 1
632
| #define HAVE_GETPAGESIZE 1
633
| #define HAVE_MMAP 1
634
| #define HAVE_BZERO 1
635
| #define HAVE_GETTIMEOFDAY 1
636
| #define HAVE_MUNMAP 1
637
| #define HAVE_SCHED_GETCPU 1
638
| #define HAVE_STRTOUL 1
639
| #define HAVE_SYSCONF 1
640
| #define CONFIG_RCU_HAVE_FENCE 1
641
| #define CONFIG_RCU_HAVE_FUTEX 1
642
| #define CONFIG_RCU_SMP 1
643
| /* end confdefs.h.  */
644
| #include <sched.h>
645
| 
646
| int
647
| main ()
648
| {
649
| if (sizeof ((cpu_set_t)))
650
| 	    return 0;
651
|   ;
652
|   return 0;
653
| }
654
configure:12892: result: yes
655
configure:12907: checking whether CPU_ZERO works
656
configure:12923: gcc -c -g -O2 -D_GNU_SOURCE  conftest.c >&5
657
conftest.c:43:0: warning: "_GNU_SOURCE" redefined [enabled by default]
658
<command-line>:0:0: note: this is the location of the previous definition
659
configure:12923: $? = 0
660
configure:12927: result: yes
661
configure:12939: checking whether CPU_SET works
662
configure:12955: gcc -c -g -O2 -D_GNU_SOURCE  conftest.c >&5
663
conftest.c:44:0: warning: "_GNU_SOURCE" redefined [enabled by default]
664
<command-line>:0:0: note: this is the location of the previous definition
665
configure:12955: $? = 0
666
configure:12959: result: yes
667
configure:12973: checking for sched_setaffinity
668
configure:12973: gcc -o conftest -g -O2 -D_GNU_SOURCE   conftest.c  >&5
669
configure:12973: $? = 0
670
configure:12973: result: yes
671
configure:12990: checking how many arguments sched_setaffinity takes
672
configure:13005: gcc -c -g -O2 -D_GNU_SOURCE  conftest.c >&5
673
configure:13005: $? = 0
674
configure:13016: result: 3
675
configure:13183: creating ./config.status
676

    
677
## ---------------------- ##
678
## Running config.status. ##
679
## ---------------------- ##
680

    
681
This file was extended by userspace-rcu config.status 0.7.4, which was
682
generated by GNU Autoconf 2.68.  Invocation command line was
683

    
684
  CONFIG_FILES    = 
685
  CONFIG_HEADERS  = 
686
  CONFIG_LINKS    = 
687
  CONFIG_COMMANDS = 
688
  $ ./config.status 
689

    
690
on sds-dut-vb
691

    
692
config.status:1145: creating Makefile
693
config.status:1145: creating doc/Makefile
694
config.status:1145: creating doc/examples/Makefile
695
config.status:1145: creating tests/Makefile
696
config.status:1145: creating liburcu.pc
697
config.status:1145: creating liburcu-bp.pc
698
config.status:1145: creating liburcu-cds.pc
699
config.status:1145: creating liburcu-qsbr.pc
700
config.status:1145: creating liburcu-mb.pc
701
config.status:1145: creating liburcu-signal.pc
702
config.status:1145: creating config.h
703
config.status:1145: creating urcu/config.h
704
config.status:1386: linking urcu/arch/x86.h to urcu/arch.h
705
config.status:1386: linking urcu/uatomic/x86.h to urcu/uatomic.h
706
config.status:1405: executing depfiles commands
707
config.status:1405: executing libtool commands
708

    
709
## ---------------- ##
710
## Cache variables. ##
711
## ---------------- ##
712

    
713
ac_cv_build=x86_64-unknown-linux-gnu
714
ac_cv_c_compiler_gnu=yes
715
ac_cv_c_inline=inline
716
ac_cv_env_CC_set=
717
ac_cv_env_CC_value=
718
ac_cv_env_CFLAGS_set=
719
ac_cv_env_CFLAGS_value=
720
ac_cv_env_CPPFLAGS_set=
721
ac_cv_env_CPPFLAGS_value=
722
ac_cv_env_CPP_set=
723
ac_cv_env_CPP_value=
724
ac_cv_env_LDFLAGS_set=
725
ac_cv_env_LDFLAGS_value=
726
ac_cv_env_LIBS_set=
727
ac_cv_env_LIBS_value=
728
ac_cv_env_build_alias_set=
729
ac_cv_env_build_alias_value=
730
ac_cv_env_host_alias_set=
731
ac_cv_env_host_alias_value=
732
ac_cv_env_target_alias_set=
733
ac_cv_env_target_alias_value=
734
ac_cv_func_bzero=yes
735
ac_cv_func_getpagesize=yes
736
ac_cv_func_gettimeofday=yes
737
ac_cv_func_malloc_0_nonnull=yes
738
ac_cv_func_mmap_fixed_mapped=yes
739
ac_cv_func_munmap=yes
740
ac_cv_func_sched_getcpu=yes
741
ac_cv_func_sched_setaffinity=yes
742
ac_cv_func_strtoul=yes
743
ac_cv_func_sysconf=yes
744
ac_cv_header_dlfcn_h=yes
745
ac_cv_header_inttypes_h=yes
746
ac_cv_header_memory_h=yes
747
ac_cv_header_stdc=yes
748
ac_cv_header_stdint_h=yes
749
ac_cv_header_stdlib_h=yes
750
ac_cv_header_string_h=yes
751
ac_cv_header_strings_h=yes
752
ac_cv_header_sys_param_h=yes
753
ac_cv_header_sys_stat_h=yes
754
ac_cv_header_sys_types_h=yes
755
ac_cv_header_unistd_h=yes
756
ac_cv_host=x86_64-unknown-linux-gnu
757
ac_cv_objext=o
758
ac_cv_path_EGREP='/bin/grep -E'
759
ac_cv_path_FGREP='/bin/grep -F'
760
ac_cv_path_GREP=/bin/grep
761
ac_cv_path_SED=/bin/sed
762
ac_cv_path_install='/usr/bin/install -c'
763
ac_cv_path_mkdir=/bin/mkdir
764
ac_cv_prog_AWK=mawk
765
ac_cv_prog_CPP='gcc -E'
766
ac_cv_prog_ac_ct_AR=ar
767
ac_cv_prog_ac_ct_CC=gcc
768
ac_cv_prog_ac_ct_MANIFEST_TOOL=mt
769
ac_cv_prog_ac_ct_OBJDUMP=objdump
770
ac_cv_prog_ac_ct_RANLIB=ranlib
771
ac_cv_prog_ac_ct_STRIP=strip
772
ac_cv_prog_cc_c89=
773
ac_cv_prog_cc_g=yes
774
ac_cv_prog_make_make_set=yes
775
ac_cv_target=x86_64-unknown-linux-gnu
776
ac_cv_tls=__thread
777
ac_cv_type_cpu_set_t=yes
778
ac_cv_type_pid_t=yes
779
ac_cv_type_size_t=yes
780
am_cv_CC_dependencies_compiler_type=gcc3
781
am_cv_make_support_nested_variables=yes
782
lt_cv_ar_at_file=@
783
lt_cv_archive_cmds_need_lc=no
784
lt_cv_deplibs_check_method=pass_all
785
lt_cv_file_magic_cmd='$MAGIC_CMD'
786
lt_cv_file_magic_test_file=
787
lt_cv_ld_reload_flag=-r
788
lt_cv_nm_interface='BSD nm'
789
lt_cv_objdir=.libs
790
lt_cv_path_LD=/usr/bin/ld
791
lt_cv_path_NM='/usr/bin/nm -B'
792
lt_cv_path_mainfest_tool=no
793
lt_cv_prog_compiler_c_o=yes
794
lt_cv_prog_compiler_pic='-fPIC -DPIC'
795
lt_cv_prog_compiler_pic_works=yes
796
lt_cv_prog_compiler_rtti_exceptions=no
797
lt_cv_prog_compiler_static_works=yes
798
lt_cv_prog_gnu_ld=yes
799
lt_cv_sharedlib_from_linklib_cmd='printf %s\n'
800
lt_cv_shlibpath_overrides_runpath=no
801
lt_cv_sys_global_symbol_pipe='sed -n -e '\''s/^.*[	 ]\([ABCDGIRSTW][ABCDGIRSTW]*\)[	 ][	 ]*\([_A-Za-z][_A-Za-z0-9]*\)$/\1 \2 \2/p'\'' | sed '\''/ __gnu_lto/d'\'''
802
lt_cv_sys_global_symbol_to_c_name_address='sed -n -e '\''s/^: \([^ ]*\)[ ]*$/  {\"\1\", (void *) 0},/p'\'' -e '\''s/^[ABCDGIRSTW]* \([^ ]*\) \([^ ]*\)$/  {"\2", (void *) \&\2},/p'\'''
803
lt_cv_sys_global_symbol_to_c_name_address_lib_prefix='sed -n -e '\''s/^: \([^ ]*\)[ ]*$/  {\"\1\", (void *) 0},/p'\'' -e '\''s/^[ABCDGIRSTW]* \([^ ]*\) \(lib[^ ]*\)$/  {"\2", (void *) \&\2},/p'\'' -e '\''s/^[ABCDGIRSTW]* \([^ ]*\) \([^ ]*\)$/  {"lib\2", (void *) \&\2},/p'\'''
804
lt_cv_sys_global_symbol_to_cdecl='sed -n -e '\''s/^T .* \(.*\)$/extern int \1();/p'\'' -e '\''s/^[ABCDGIRSTW]* .* \(.*\)$/extern char \1;/p'\'''
805
lt_cv_sys_max_cmd_len=1572864
806
lt_cv_to_host_file_cmd=func_convert_file_noop
807
lt_cv_to_tool_file_cmd=func_convert_file_noop
808

    
809
## ----------------- ##
810
## Output variables. ##
811
## ----------------- ##
812

    
813
ACLOCAL='${SHELL} /usr/src/userspace-rcu-0.7.4/config/missing --run aclocal-1.11'
814
AMDEPBACKSLASH='\'
815
AMDEP_FALSE='#'
816
AMDEP_TRUE=''
817
AMTAR='$${TAR-tar}'
818
AM_BACKSLASH='\'
819
AM_DEFAULT_V='$(AM_DEFAULT_VERBOSITY)'
820
AM_DEFAULT_VERBOSITY='0'
821
AM_V='$(V)'
822
AR='ar'
823
ARCHTYPE='x86'
824
AUTOCONF='${SHELL} /usr/src/userspace-rcu-0.7.4/config/missing --run autoconf'
825
AUTOHEADER='${SHELL} /usr/src/userspace-rcu-0.7.4/config/missing --run autoheader'
826
AUTOMAKE='${SHELL} /usr/src/userspace-rcu-0.7.4/config/missing --run automake-1.11'
827
AWK='mawk'
828
CC='gcc'
829
CCDEPMODE='depmode=gcc3'
830
CFLAGS='-g -O2'
831
COMPAT_ARCH_FALSE=''
832
COMPAT_ARCH_TRUE='#'
833
COMPAT_FUTEX_FALSE=''
834
COMPAT_FUTEX_TRUE='#'
835
CPP='gcc -E'
836
CPPFLAGS=''
837
CYGPATH_W='echo'
838
DEFS='-DHAVE_CONFIG_H'
839
DEPDIR='.deps'
840
DLLTOOL='false'
841
DSYMUTIL=''
842
DUMPBIN=''
843
ECHO_C=''
844
ECHO_N='-n'
845
ECHO_T=''
846
EGREP='/bin/grep -E'
847
EXEEXT=''
848
FGREP='/bin/grep -F'
849
GREP='/bin/grep'
850
INSTALL_DATA='${INSTALL} -m 644'
851
INSTALL_PROGRAM='${INSTALL}'
852
INSTALL_SCRIPT='${INSTALL}'
853
INSTALL_STRIP_PROGRAM='$(install_sh) -c -s'
854
LD='/usr/bin/ld -m elf_x86_64'
855
LDFLAGS=''
856
LIBOBJS=''
857
LIBS=''
858
LIBTOOL='$(SHELL) $(top_builddir)/libtool'
859
LIPO=''
860
LN_S='ln -s'
861
LTLIBOBJS=''
862
MAKEINFO='${SHELL} /usr/src/userspace-rcu-0.7.4/config/missing --run makeinfo'
863
MANIFEST_TOOL=':'
864
MKDIR_P='/bin/mkdir -p'
865
NM='/usr/bin/nm -B'
866
NMEDIT=''
867
NO_SHARED_FALSE=''
868
NO_SHARED_TRUE='#'
869
OBJDUMP='objdump'
870
OBJEXT='o'
871
OTOOL64=''
872
OTOOL=''
873
PACKAGE='userspace-rcu'
874
PACKAGE_BUGREPORT='mathieu dot desnoyers at efficios dot com'
875
PACKAGE_NAME='userspace-rcu'
876
PACKAGE_STRING='userspace-rcu 0.7.4'
877
PACKAGE_TARNAME='userspace-rcu'
878
PACKAGE_URL=''
879
PACKAGE_VERSION='0.7.4'
880
PATH_SEPARATOR=':'
881
RANLIB='ranlib'
882
SED='/bin/sed'
883
SET_MAKE=''
884
SHELL='/bin/bash'
885
STRIP='strip'
886
SUBARCHTYPE=''
887
URCU_LIBRARY_VERSION='2:0:0'
888
VERSION='0.7.4'
889
ac_ct_AR='ar'
890
ac_ct_CC='gcc'
891
ac_ct_DUMPBIN=''
892
am__EXEEXT_FALSE=''
893
am__EXEEXT_TRUE='#'
894
am__fastdepCC_FALSE='#'
895
am__fastdepCC_TRUE=''
896
am__include='include'
897
am__isrc=''
898
am__leading_dot='.'
899
am__nodep='_no'
900
am__quote=''
901
am__tar='$${TAR-tar} chof - "$$tardir"'
902
am__untar='$${TAR-tar} xf -'
903
bindir='${exec_prefix}/bin'
904
build='x86_64-unknown-linux-gnu'
905
build_alias=''
906
build_cpu='x86_64'
907
build_os='linux-gnu'
908
build_vendor='unknown'
909
datadir='${datarootdir}'
910
datarootdir='${prefix}/share'
911
docdir='${datarootdir}/doc/${PACKAGE_TARNAME}'
912
dvidir='${docdir}'
913
exec_prefix='${prefix}'
914
host='x86_64-unknown-linux-gnu'
915
host_alias=''
916
host_cpu='x86_64'
917
host_os='linux-gnu'
918
host_vendor='unknown'
919
htmldir='${docdir}'
920
includedir='${prefix}/include'
921
infodir='${datarootdir}/info'
922
install_sh='${SHELL} /usr/src/userspace-rcu-0.7.4/config/install-sh'
923
libdir='${exec_prefix}/lib'
924
libexecdir='${exec_prefix}/libexec'
925
localedir='${datarootdir}/locale'
926
localstatedir='${prefix}/var'
927
mandir='${datarootdir}/man'
928
mkdir_p='/bin/mkdir -p'
929
oldincludedir='/usr/include'
930
pdfdir='${docdir}'
931
prefix='/usr/local'
932
program_transform_name='s,x,x,'
933
psdir='${docdir}'
934
sbindir='${exec_prefix}/sbin'
935
sharedstatedir='${prefix}/com'
936
sysconfdir='${prefix}/etc'
937
target='x86_64-unknown-linux-gnu'
938
target_alias=''
939
target_cpu='x86_64'
940
target_os='linux-gnu'
941
target_vendor='unknown'
942

    
943
## ----------- ##
944
## confdefs.h. ##
945
## ----------- ##
946

    
947
/* confdefs.h */
948
#define PACKAGE_NAME "userspace-rcu"
949
#define PACKAGE_TARNAME "userspace-rcu"
950
#define PACKAGE_VERSION "0.7.4"
951
#define PACKAGE_STRING "userspace-rcu 0.7.4"
952
#define PACKAGE_BUGREPORT "mathieu dot desnoyers at efficios dot com"
953
#define PACKAGE_URL ""
954
#define PACKAGE "userspace-rcu"
955
#define VERSION "0.7.4"
956
#define TLS __thread
957
#define CONFIG_RCU_TLS __thread
958
#define STDC_HEADERS 1
959
#define HAVE_SYS_TYPES_H 1
960
#define HAVE_SYS_STAT_H 1
961
#define HAVE_STDLIB_H 1
962
#define HAVE_STRING_H 1
963
#define HAVE_MEMORY_H 1
964
#define HAVE_STRINGS_H 1
965
#define HAVE_INTTYPES_H 1
966
#define HAVE_STDINT_H 1
967
#define HAVE_UNISTD_H 1
968
#define HAVE_DLFCN_H 1
969
#define LT_OBJDIR ".libs/"
970
#define HAVE_STDLIB_H 1
971
#define HAVE_MALLOC 1
972
#define HAVE_STDLIB_H 1
973
#define HAVE_UNISTD_H 1
974
#define HAVE_SYS_PARAM_H 1
975
#define HAVE_GETPAGESIZE 1
976
#define HAVE_MMAP 1
977
#define HAVE_BZERO 1
978
#define HAVE_GETTIMEOFDAY 1
979
#define HAVE_MUNMAP 1
980
#define HAVE_SCHED_GETCPU 1
981
#define HAVE_STRTOUL 1
982
#define HAVE_SYSCONF 1
983
#define CONFIG_RCU_HAVE_FENCE 1
984
#define CONFIG_RCU_HAVE_FUTEX 1
985
#define CONFIG_RCU_SMP 1
986
#define HAVE_CPU_SET_T 1
987
#define HAVE_CPU_ZERO 1
988
#define HAVE_CPU_SET 1
989
#define HAVE_SCHED_SETAFFINITY 1
990
#define SCHED_SETAFFINITY_ARGS 3
991

    
992
configure: exit 0
(7-7/9)